Build failed in Jenkins: Pivot-trunk on Java 7 #1224

classic Classic list List threaded Threaded
4 messages Options
Reply | Threaded
Open this post in threaded view
|  
Report Content as Inappropriate

Build failed in Jenkins: Pivot-trunk on Java 7 #1224

Apache Jenkins Server
See <https://builds.apache.org/job/Pivot-trunk%20on%20Java%207/1224/display/redirect?page=changes>

Changes:

[rwhitcomb] Trying to debug why unit tests are failing on Jenkins:
* Halt and fail the build if the unit tests fail.
* Turn on "verbose" for the tests to see exactly what's wrong
  (note: this should be reverted once the cause is pinpointed).

------------------------------------------
Started by an SCM change
[EnvInject] - Loading node environment variables.
Building remotely on H17 (ubuntu xenial) in workspace <https://builds.apache.org/job/Pivot-trunk%20on%20Java%207/ws/>
Reverting <https://builds.apache.org/job/Pivot-trunk%20on%20Java%207/ws/.> to depth infinity with ignoreExternals: false
Updating http://svn.apache.org/repos/asf/pivot/jenkins at revision '2017-05-15T01:37:08.227 +0000'
At revision 1795128

Reverting <https://builds.apache.org/job/Pivot-trunk%20on%20Java%207/ws/pivot_trunk> to depth infinity with ignoreExternals: false
Updating http://svn.apache.org/repos/asf/pivot/trunk at revision '2017-05-15T01:37:08.227 +0000'
U         core/src/org/apache/pivot/beans/BXMLSerializer.java
U         build.properties
U         build.xml
AU        script
U         wtk/src/org/apache/pivot/wtk/ScriptApplication.java
A         script.bat
U         wtk-terra/src/org/apache/pivot/wtk/skin/terra/TerraTextInputSkin.java
At revision 1795128

No changes for http://svn.apache.org/repos/asf/pivot/jenkins since the previous build
[EnvInject] - Executing scripts and injecting environment variables after the SCM step.
[Pivot-trunk on Java 7] $ /home/jenkins/tools/ant/apache-ant-1.9.9/bin/ant check clean package test doc deploy package-tests package-sources package-javadoc
Buildfile: <https://builds.apache.org/job/Pivot-trunk%20on%20Java%207/ws/build.xml>

help:
     [echo] Using Classpath: <https://builds.apache.org/job/Pivot-trunk%20on%20Java%207/ws/ci-builds-on-jenkins/lib/junit-4.12.jar>:<https://builds.apache.org/job/Pivot-trunk%20on%20Java%207/ws/ci-builds-on-jenkins/lib/maven-ant-tasks-2.1.3.jar>:<https://builds.apache.org/job/Pivot-trunk%20on%20Java%207/ws/pivot_trunk/${env.CLASSPATH}>:/usr/local/asfpackages/java/jdk1.7.0_80/jre/lib/alt-rt.jar:/usr/local/asfpackages/java/jdk1.7.0_80/jre/lib/charsets.jar:/usr/local/asfpackages/java/jdk1.7.0_80/jre/lib/deploy.jar:/usr/local/asfpackages/java/jdk1.7.0_80/jre/lib/ext/dnsns.jar:/usr/local/asfpackages/java/jdk1.7.0_80/jre/lib/ext/localedata.jar:/usr/local/asfpackages/java/jdk1.7.0_80/jre/lib/ext/sunec.jar:/usr/local/asfpackages/java/jdk1.7.0_80/jre/lib/ext/sunjce_provider.jar:/usr/local/asfpackages/java/jdk1.7.0_80/jre/lib/ext/sunpkcs11.jar:/usr/local/asfpackages/java/jdk1.7.0_80/jre/lib/ext/zipfs.jar:/usr/local/asfpackages/java/jdk1.7.0_80/jre/lib/javaws.jar:/usr/local/asfpackages/java/jdk1.7.0_80/jre/lib/jce.jar:/usr/local/asfpackages/java/jdk1.7.0_80/jre/lib/jfr.jar:/usr/local/asfpackages/java/jdk1.7.0_80/jre/lib/jsse.jar:/usr/local/asfpackages/java/jdk1.7.0_80/jre/lib/management-agent.jar:/usr/local/asfpackages/java/jdk1.7.0_80/jre/lib/plugin.jar:/usr/local/asfpackages/java/jdk1.7.0_80/jre/lib/resources.jar:/usr/local/asfpackages/java/jdk1.7.0_80/jre/lib/rt.jar:/usr/local/asfpackages/java/jdk1.7.0_80/jre/lib/security/US_export_policy.jar:/usr/local/asfpackages/java/jdk1.7.0_80/jre/lib/security/local_policy.jar

check:

clean:

environment-info:
     [echo]
     [echo] Compile environment for pivot_build_by_jenkins-2.1.0 is:
     [echo] show deprecation true
     [echo] debug true
     [echo] source 1.7, target 1.7
     [echo] encoding UTF-8
     [echo] indexJars true
     [echo] arg -Xlint
     [echo]
     [echo] OS: Linux, version 4.4.0-43-generic, architecture amd64
     [echo]
     [echo] Java: home at '/usr/local/asfpackages/java/jdk1.7.0_80/jre', version 1.7.0_80, vendor Oracle Corporation
     [echo]

core:
    [mkdir] Created dir: <https://builds.apache.org/job/Pivot-trunk%20on%20Java%207/ws/pivot_trunk/core/ant-bin>
    [javac] Compiling 161 source files to <https://builds.apache.org/job/Pivot-trunk%20on%20Java%207/ws/pivot_trunk/core/ant-bin>

wtk:
    [mkdir] Created dir: <https://builds.apache.org/job/Pivot-trunk%20on%20Java%207/ws/pivot_trunk/wtk/ant-bin>
    [javac] Compiling 412 source files to <https://builds.apache.org/job/Pivot-trunk%20on%20Java%207/ws/pivot_trunk/wtk/ant-bin>

charts:
    [mkdir] Created dir: <https://builds.apache.org/job/Pivot-trunk%20on%20Java%207/ws/pivot_trunk/charts/ant-bin>
    [javac] Compiling 26 source files to <https://builds.apache.org/job/Pivot-trunk%20on%20Java%207/ws/pivot_trunk/charts/ant-bin>

wtk-terra:
    [mkdir] Created dir: <https://builds.apache.org/job/Pivot-trunk%20on%20Java%207/ws/pivot_trunk/wtk-terra/ant-bin>
    [javac] Compiling 58 source files to <https://builds.apache.org/job/Pivot-trunk%20on%20Java%207/ws/pivot_trunk/wtk-terra/ant-bin>

web:
    [mkdir] Created dir: <https://builds.apache.org/job/Pivot-trunk%20on%20Java%207/ws/pivot_trunk/web/ant-bin>
    [javac] Compiling 11 source files to <https://builds.apache.org/job/Pivot-trunk%20on%20Java%207/ws/pivot_trunk/web/ant-bin>

demos:
    [mkdir] Created dir: <https://builds.apache.org/job/Pivot-trunk%20on%20Java%207/ws/pivot_trunk/demos/ant-bin>
    [javac] Compiling 25 source files to <https://builds.apache.org/job/Pivot-trunk%20on%20Java%207/ws/pivot_trunk/demos/ant-bin>

web-server:
    [mkdir] Created dir: <https://builds.apache.org/job/Pivot-trunk%20on%20Java%207/ws/pivot_trunk/web-server/ant-bin>
    [javac] Compiling 2 source files to <https://builds.apache.org/job/Pivot-trunk%20on%20Java%207/ws/pivot_trunk/web-server/ant-bin>

demos-server:
    [mkdir] Created dir: <https://builds.apache.org/job/Pivot-trunk%20on%20Java%207/ws/pivot_trunk/demos-server/ant-bin>
    [javac] Compiling 1 source file to <https://builds.apache.org/job/Pivot-trunk%20on%20Java%207/ws/pivot_trunk/demos-server/ant-bin>

tutorials:
    [mkdir] Created dir: <https://builds.apache.org/job/Pivot-trunk%20on%20Java%207/ws/pivot_trunk/tutorials/ant-bin>
    [javac] Compiling 90 source files to <https://builds.apache.org/job/Pivot-trunk%20on%20Java%207/ws/pivot_trunk/tutorials/ant-bin>
     [copy] Copying 242 files to <https://builds.apache.org/job/Pivot-trunk%20on%20Java%207/ws/pivot_trunk/tutorials/ant-bin>

tutorials-server:
    [mkdir] Created dir: <https://builds.apache.org/job/Pivot-trunk%20on%20Java%207/ws/pivot_trunk/tutorials-server/ant-bin>
    [javac] Compiling 2 source files to <https://builds.apache.org/job/Pivot-trunk%20on%20Java%207/ws/pivot_trunk/tutorials-server/ant-bin>

compile:

package:
    [mkdir] Created dir: <https://builds.apache.org/job/Pivot-trunk%20on%20Java%207/ws/pivot_trunk/lib>
      [jar] Building jar: <https://builds.apache.org/job/Pivot-trunk%20on%20Java%207/ws/pivot_trunk/lib/pivot_build_by_jenkins-charts-2.1.0.jar>
      [jar] Building jar: <https://builds.apache.org/job/Pivot-trunk%20on%20Java%207/ws/pivot_trunk/lib/pivot_build_by_jenkins-core-2.1.0.jar>
      [jar] Building jar: <https://builds.apache.org/job/Pivot-trunk%20on%20Java%207/ws/pivot_trunk/lib/pivot_build_by_jenkins-demos-2.1.0.jar>
      [jar] Building jar: <https://builds.apache.org/job/Pivot-trunk%20on%20Java%207/ws/pivot_trunk/lib/pivot_build_by_jenkins-demos-server-2.1.0.jar>
      [jar] Building jar: <https://builds.apache.org/job/Pivot-trunk%20on%20Java%207/ws/pivot_trunk/lib/pivot_build_by_jenkins-tutorials-2.1.0.jar>
      [jar] Building jar: <https://builds.apache.org/job/Pivot-trunk%20on%20Java%207/ws/pivot_trunk/lib/pivot_build_by_jenkins-tutorials-server-2.1.0.jar>
      [jar] Building jar: <https://builds.apache.org/job/Pivot-trunk%20on%20Java%207/ws/pivot_trunk/lib/pivot_build_by_jenkins-web-2.1.0.jar>
      [jar] Building jar: <https://builds.apache.org/job/Pivot-trunk%20on%20Java%207/ws/pivot_trunk/lib/pivot_build_by_jenkins-web-server-2.1.0.jar>
      [jar] Building jar: <https://builds.apache.org/job/Pivot-trunk%20on%20Java%207/ws/pivot_trunk/lib/pivot_build_by_jenkins-wtk-2.1.0.jar>
      [jar] Building jar: <https://builds.apache.org/job/Pivot-trunk%20on%20Java%207/ws/pivot_trunk/lib/pivot_build_by_jenkins-wtk-terra-2.1.0.jar>

environment-info:
     [echo]
     [echo] Compile environment for pivot_build_by_jenkins-2.1.0 is:
     [echo] show deprecation true
     [echo] debug true
     [echo] source 1.7, target 1.7
     [echo] encoding UTF-8
     [echo] indexJars true
     [echo] arg -Xlint
     [echo]
     [echo] OS: Linux, version 4.4.0-43-generic, architecture amd64
     [echo]
     [echo] Java: home at '/usr/local/asfpackages/java/jdk1.7.0_80/jre', version 1.7.0_80, vendor Oracle Corporation
     [echo]

core:

wtk:

charts:

wtk-terra:

web:

demos:

web-server:

demos-server:

tutorials:

tutorials-server:

compile:

tests:
    [mkdir] Created dir: <https://builds.apache.org/job/Pivot-trunk%20on%20Java%207/ws/pivot_trunk/tests/ant-bin>
    [javac] Compiling 92 source files to <https://builds.apache.org/job/Pivot-trunk%20on%20Java%207/ws/pivot_trunk/tests/ant-bin>
     [copy] Copying 132 files to <https://builds.apache.org/job/Pivot-trunk%20on%20Java%207/ws/pivot_trunk/tests/ant-bin>

compile-tests:

test:
     [echo] charts: Executing test cases...
     [echo] core: Executing test cases...
    [junit] Testsuite: org.apache.pivot.beans.test.BeanAdapterTest
    [junit] Tests run: 1, Failures: 0, Errors: 1, Skipped: 0, Time elapsed: 0.016 sec
    [junit]
    [junit] Testcase: initializationError(org.apache.pivot.beans.test.BeanAdapterTest): Caused an ERROR
    [junit] org/hamcrest/SelfDescribing
    [junit] java.lang.NoClassDefFoundError: org/hamcrest/SelfDescribing
    [junit] at java.lang.ClassLoader.defineClass1(Native Method)
    [junit] at java.lang.ClassLoader.defineClass(ClassLoader.java:800)
    [junit] at java.security.SecureClassLoader.defineClass(SecureClassLoader.java:142)
    [junit] at java.net.URLClassLoader.defineClass(URLClassLoader.java:449)
    [junit] at java.net.URLClassLoader.access$100(URLClassLoader.java:71)
    [junit] at java.net.URLClassLoader$1.run(URLClassLoader.java:361)
    [junit] at java.net.URLClassLoader$1.run(URLClassLoader.java:355)
    [junit] at java.security.AccessController.doPrivileged(Native Method)
    [junit] at java.net.URLClassLoader.findClass(URLClassLoader.java:354)
    [junit] at java.lang.ClassLoader.loadClass(ClassLoader.java:425)
    [junit] at sun.misc.Launcher$AppClassLoader.loadClass(Launcher.java:308)
    [junit] at java.lang.ClassLoader.loadClass(ClassLoader.java:358)
    [junit] at java.lang.reflect.Constructor.newInstance(Constructor.java:526)
    [junit] Caused by: java.lang.ClassNotFoundException: org.hamcrest.SelfDescribing
    [junit] at java.net.URLClassLoader$1.run(URLClassLoader.java:366)
    [junit] at java.net.URLClassLoader$1.run(URLClassLoader.java:355)
    [junit] at java.security.AccessController.doPrivileged(Native Method)
    [junit] at java.net.URLClassLoader.findClass(URLClassLoader.java:354)
    [junit] at java.lang.ClassLoader.loadClass(ClassLoader.java:425)
    [junit] at sun.misc.Launcher$AppClassLoader.loadClass(Launcher.java:308)
    [junit] at java.lang.ClassLoader.loadClass(ClassLoader.java:358)
    [junit]
    [junit]

BUILD FAILED
<https://builds.apache.org/job/Pivot-trunk%20on%20Java%207/ws/pivot_trunk/build.xml>:450: The following error occurred while executing this line:
<https://builds.apache.org/job/Pivot-trunk%20on%20Java%207/ws/pivot_trunk/build.xml>:183: Test org.apache.pivot.beans.test.BeanAdapterTest failed

Total time: 14 seconds
Build step 'Invoke Ant' marked build as failure
Reply | Threaded
Open this post in threaded view
|  
Report Content as Inappropriate

Build failed in Jenkins: Pivot-trunk on Java 7 #1225

Apache Jenkins Server
See <https://builds.apache.org/job/Pivot-trunk%20on%20Java%207/1225/display/redirect?page=changes>

Changes:

[rwhitcomb] Remove "haltonfailure" for unit tests to allow all tests to complete.

------------------------------------------
[...truncated 52.98 KB...]
    [junit] at java.lang.ClassLoader.defineClass1(Native Method)
    [junit] at java.lang.ClassLoader.defineClass(ClassLoader.java:800)
    [junit] at java.security.SecureClassLoader.defineClass(SecureClassLoader.java:142)
    [junit] at java.net.URLClassLoader.defineClass(URLClassLoader.java:449)
    [junit] at java.net.URLClassLoader.access$100(URLClassLoader.java:71)
    [junit] at java.net.URLClassLoader$1.run(URLClassLoader.java:361)
    [junit] at java.net.URLClassLoader$1.run(URLClassLoader.java:355)
    [junit] at java.security.AccessController.doPrivileged(Native Method)
    [junit] at java.net.URLClassLoader.findClass(URLClassLoader.java:354)
    [junit] at java.lang.ClassLoader.loadClass(ClassLoader.java:425)
    [junit] at sun.misc.Launcher$AppClassLoader.loadClass(Launcher.java:308)
    [junit] at java.lang.ClassLoader.loadClass(ClassLoader.java:358)
    [junit] at java.lang.reflect.Constructor.newInstance(Constructor.java:526)
    [junit] Caused by: java.lang.ClassNotFoundException: org.hamcrest.SelfDescribing
    [junit] at java.net.URLClassLoader$1.run(URLClassLoader.java:366)
    [junit] at java.net.URLClassLoader$1.run(URLClassLoader.java:355)
    [junit] at java.security.AccessController.doPrivileged(Native Method)
    [junit] at java.net.URLClassLoader.findClass(URLClassLoader.java:354)
    [junit] at java.lang.ClassLoader.loadClass(ClassLoader.java:425)
    [junit] at sun.misc.Launcher$AppClassLoader.loadClass(Launcher.java:308)
    [junit] at java.lang.ClassLoader.loadClass(ClassLoader.java:358)
    [junit]
    [junit]
    [junit] Test org.apache.pivot.serialization.test.StringSerializerTest FAILED
    [junit] Testsuite: org.apache.pivot.util.concurrent.test.TaskTest
    [junit] Tests run: 1, Failures: 0, Errors: 1, Skipped: 0, Time elapsed: 0.017 sec
    [junit]
    [junit] Testcase: initializationError(org.apache.pivot.util.concurrent.test.TaskTest): Caused an ERROR
    [junit] org/hamcrest/SelfDescribing
    [junit] java.lang.NoClassDefFoundError: org/hamcrest/SelfDescribing
    [junit] at java.lang.ClassLoader.defineClass1(Native Method)
    [junit] at java.lang.ClassLoader.defineClass(ClassLoader.java:800)
    [junit] at java.security.SecureClassLoader.defineClass(SecureClassLoader.java:142)
    [junit] at java.net.URLClassLoader.defineClass(URLClassLoader.java:449)
    [junit] at java.net.URLClassLoader.access$100(URLClassLoader.java:71)
    [junit] at java.net.URLClassLoader$1.run(URLClassLoader.java:361)
    [junit] at java.net.URLClassLoader$1.run(URLClassLoader.java:355)
    [junit] at java.security.AccessController.doPrivileged(Native Method)
    [junit] at java.net.URLClassLoader.findClass(URLClassLoader.java:354)
    [junit] at java.lang.ClassLoader.loadClass(ClassLoader.java:425)
    [junit] at sun.misc.Launcher$AppClassLoader.loadClass(Launcher.java:308)
    [junit] at java.lang.ClassLoader.loadClass(ClassLoader.java:358)
    [junit] at java.lang.reflect.Constructor.newInstance(Constructor.java:526)
    [junit] Caused by: java.lang.ClassNotFoundException: org.hamcrest.SelfDescribing
    [junit] at java.net.URLClassLoader$1.run(URLClassLoader.java:366)
    [junit] at java.net.URLClassLoader$1.run(URLClassLoader.java:355)
    [junit] at java.security.AccessController.doPrivileged(Native Method)
    [junit] at java.net.URLClassLoader.findClass(URLClassLoader.java:354)
    [junit] at java.lang.ClassLoader.loadClass(ClassLoader.java:425)
    [junit] at sun.misc.Launcher$AppClassLoader.loadClass(Launcher.java:308)
    [junit] at java.lang.ClassLoader.loadClass(ClassLoader.java:358)
    [junit]
    [junit]
    [junit] Test org.apache.pivot.util.concurrent.test.TaskTest FAILED
    [junit] Testsuite: org.apache.pivot.util.test.MIMETypeTest
    [junit] Tests run: 1, Failures: 0, Errors: 1, Skipped: 0, Time elapsed: 0.017 sec
    [junit]
    [junit] Testcase: initializationError(org.apache.pivot.util.test.MIMETypeTest): Caused an ERROR
    [junit] org/hamcrest/SelfDescribing
    [junit] java.lang.NoClassDefFoundError: org/hamcrest/SelfDescribing
    [junit] at java.lang.ClassLoader.defineClass1(Native Method)
    [junit] at java.lang.ClassLoader.defineClass(ClassLoader.java:800)
    [junit] at java.security.SecureClassLoader.defineClass(SecureClassLoader.java:142)
    [junit] at java.net.URLClassLoader.defineClass(URLClassLoader.java:449)
    [junit] at java.net.URLClassLoader.access$100(URLClassLoader.java:71)
    [junit] at java.net.URLClassLoader$1.run(URLClassLoader.java:361)
    [junit] at java.net.URLClassLoader$1.run(URLClassLoader.java:355)
    [junit] at java.security.AccessController.doPrivileged(Native Method)
    [junit] at java.net.URLClassLoader.findClass(URLClassLoader.java:354)
    [junit] at java.lang.ClassLoader.loadClass(ClassLoader.java:425)
    [junit] at sun.misc.Launcher$AppClassLoader.loadClass(Launcher.java:308)
    [junit] at java.lang.ClassLoader.loadClass(ClassLoader.java:358)
    [junit] at java.lang.reflect.Constructor.newInstance(Constructor.java:526)
    [junit] Caused by: java.lang.ClassNotFoundException: org.hamcrest.SelfDescribing
    [junit] at java.net.URLClassLoader$1.run(URLClassLoader.java:366)
    [junit] at java.net.URLClassLoader$1.run(URLClassLoader.java:355)
    [junit] at java.security.AccessController.doPrivileged(Native Method)
    [junit] at java.net.URLClassLoader.findClass(URLClassLoader.java:354)
    [junit] at java.lang.ClassLoader.loadClass(ClassLoader.java:425)
    [junit] at sun.misc.Launcher$AppClassLoader.loadClass(Launcher.java:308)
    [junit] at java.lang.ClassLoader.loadClass(ClassLoader.java:358)
    [junit]
    [junit]
    [junit] Test org.apache.pivot.util.test.MIMETypeTest FAILED
    [junit] Testsuite: org.apache.pivot.util.test.ParentResourcesTest
    [junit] Tests run: 1, Failures: 0, Errors: 1, Skipped: 0, Time elapsed: 0.018 sec
    [junit]
    [junit] Testcase: initializationError(org.apache.pivot.util.test.ParentResourcesTest): Caused an ERROR
    [junit] org/hamcrest/SelfDescribing
    [junit] java.lang.NoClassDefFoundError: org/hamcrest/SelfDescribing
    [junit] at java.lang.ClassLoader.defineClass1(Native Method)
    [junit] at java.lang.ClassLoader.defineClass(ClassLoader.java:800)
    [junit] at java.security.SecureClassLoader.defineClass(SecureClassLoader.java:142)
    [junit] at java.net.URLClassLoader.defineClass(URLClassLoader.java:449)
    [junit] at java.net.URLClassLoader.access$100(URLClassLoader.java:71)
    [junit] at java.net.URLClassLoader$1.run(URLClassLoader.java:361)
    [junit] at java.net.URLClassLoader$1.run(URLClassLoader.java:355)
    [junit] at java.security.AccessController.doPrivileged(Native Method)
    [junit] at java.net.URLClassLoader.findClass(URLClassLoader.java:354)
    [junit] at java.lang.ClassLoader.loadClass(ClassLoader.java:425)
    [junit] at sun.misc.Launcher$AppClassLoader.loadClass(Launcher.java:308)
    [junit] at java.lang.ClassLoader.loadClass(ClassLoader.java:358)
    [junit] at java.lang.reflect.Constructor.newInstance(Constructor.java:526)
    [junit] Caused by: java.lang.ClassNotFoundException: org.hamcrest.SelfDescribing
    [junit] at java.net.URLClassLoader$1.run(URLClassLoader.java:366)
    [junit] at java.net.URLClassLoader$1.run(URLClassLoader.java:355)
    [junit] at java.security.AccessController.doPrivileged(Native Method)
    [junit] at java.net.URLClassLoader.findClass(URLClassLoader.java:354)
    [junit] at java.lang.ClassLoader.loadClass(ClassLoader.java:425)
    [junit] at sun.misc.Launcher$AppClassLoader.loadClass(Launcher.java:308)
    [junit] at java.lang.ClassLoader.loadClass(ClassLoader.java:358)
    [junit]
    [junit]
    [junit] Test org.apache.pivot.util.test.ParentResourcesTest FAILED
    [junit] Testsuite: org.apache.pivot.util.test.TimeTest
    [junit] Tests run: 1, Failures: 0, Errors: 1, Skipped: 0, Time elapsed: 0.017 sec
    [junit]
    [junit] Testcase: initializationError(org.apache.pivot.util.test.TimeTest): Caused an ERROR
    [junit] org/hamcrest/SelfDescribing
    [junit] java.lang.NoClassDefFoundError: org/hamcrest/SelfDescribing
    [junit] at java.lang.ClassLoader.defineClass1(Native Method)
    [junit] at java.lang.ClassLoader.defineClass(ClassLoader.java:800)
    [junit] at java.security.SecureClassLoader.defineClass(SecureClassLoader.java:142)
    [junit] at java.net.URLClassLoader.defineClass(URLClassLoader.java:449)
    [junit] at java.net.URLClassLoader.access$100(URLClassLoader.java:71)
    [junit] at java.net.URLClassLoader$1.run(URLClassLoader.java:361)
    [junit] at java.net.URLClassLoader$1.run(URLClassLoader.java:355)
    [junit] at java.security.AccessController.doPrivileged(Native Method)
    [junit] at java.net.URLClassLoader.findClass(URLClassLoader.java:354)
    [junit] at java.lang.ClassLoader.loadClass(ClassLoader.java:425)
    [junit] at sun.misc.Launcher$AppClassLoader.loadClass(Launcher.java:308)
    [junit] at java.lang.ClassLoader.loadClass(ClassLoader.java:358)
    [junit] at java.lang.reflect.Constructor.newInstance(Constructor.java:526)
    [junit] Caused by: java.lang.ClassNotFoundException: org.hamcrest.SelfDescribing
    [junit] at java.net.URLClassLoader$1.run(URLClassLoader.java:366)
    [junit] at java.net.URLClassLoader$1.run(URLClassLoader.java:355)
    [junit] at java.security.AccessController.doPrivileged(Native Method)
    [junit] at java.net.URLClassLoader.findClass(URLClassLoader.java:354)
    [junit] at java.lang.ClassLoader.loadClass(ClassLoader.java:425)
    [junit] at sun.misc.Launcher$AppClassLoader.loadClass(Launcher.java:308)
    [junit] at java.lang.ClassLoader.loadClass(ClassLoader.java:358)
    [junit]
    [junit]
    [junit] Test org.apache.pivot.util.test.TimeTest FAILED
    [junit] Testsuite: org.apache.pivot.util.test.VersionTest
    [junit] Tests run: 1, Failures: 0, Errors: 1, Skipped: 0, Time elapsed: 0.018 sec
    [junit]
    [junit] Testcase: initializationError(org.apache.pivot.util.test.VersionTest): Caused an ERROR
    [junit] org/hamcrest/SelfDescribing
    [junit] java.lang.NoClassDefFoundError: org/hamcrest/SelfDescribing
    [junit] at java.lang.ClassLoader.defineClass1(Native Method)
    [junit] at java.lang.ClassLoader.defineClass(ClassLoader.java:800)
    [junit] at java.security.SecureClassLoader.defineClass(SecureClassLoader.java:142)
    [junit] at java.net.URLClassLoader.defineClass(URLClassLoader.java:449)
    [junit] at java.net.URLClassLoader.access$100(URLClassLoader.java:71)
    [junit] at java.net.URLClassLoader$1.run(URLClassLoader.java:361)
    [junit] at java.net.URLClassLoader$1.run(URLClassLoader.java:355)
    [junit] at java.security.AccessController.doPrivileged(Native Method)
    [junit] at java.net.URLClassLoader.findClass(URLClassLoader.java:354)
    [junit] at java.lang.ClassLoader.loadClass(ClassLoader.java:425)
    [junit] at sun.misc.Launcher$AppClassLoader.loadClass(Launcher.java:308)
    [junit] at java.lang.ClassLoader.loadClass(ClassLoader.java:358)
    [junit] at java.lang.reflect.Constructor.newInstance(Constructor.java:526)
    [junit] Caused by: java.lang.ClassNotFoundException: org.hamcrest.SelfDescribing
    [junit] at java.net.URLClassLoader$1.run(URLClassLoader.java:366)
    [junit] at java.net.URLClassLoader$1.run(URLClassLoader.java:355)
    [junit] at java.security.AccessController.doPrivileged(Native Method)
    [junit] at java.net.URLClassLoader.findClass(URLClassLoader.java:354)
    [junit] at java.lang.ClassLoader.loadClass(ClassLoader.java:425)
    [junit] at sun.misc.Launcher$AppClassLoader.loadClass(Launcher.java:308)
    [junit] at java.lang.ClassLoader.loadClass(ClassLoader.java:358)
    [junit]
    [junit]
    [junit] Test org.apache.pivot.util.test.VersionTest FAILED
    [junit] Testsuite: org.apache.pivot.xml.test.XMLSerializerTest
    [junit] Tests run: 1, Failures: 0, Errors: 1, Skipped: 0, Time elapsed: 0.027 sec
    [junit]
    [junit] Testcase: initializationError(org.apache.pivot.xml.test.XMLSerializerTest): Caused an ERROR
    [junit] org/hamcrest/SelfDescribing
    [junit] java.lang.NoClassDefFoundError: org/hamcrest/SelfDescribing
    [junit] at java.lang.ClassLoader.defineClass1(Native Method)
    [junit] at java.lang.ClassLoader.defineClass(ClassLoader.java:800)
    [junit] at java.security.SecureClassLoader.defineClass(SecureClassLoader.java:142)
    [junit] at java.net.URLClassLoader.defineClass(URLClassLoader.java:449)
    [junit] at java.net.URLClassLoader.access$100(URLClassLoader.java:71)
    [junit] at java.net.URLClassLoader$1.run(URLClassLoader.java:361)
    [junit] at java.net.URLClassLoader$1.run(URLClassLoader.java:355)
    [junit] at java.security.AccessController.doPrivileged(Native Method)
    [junit] at java.net.URLClassLoader.findClass(URLClassLoader.java:354)
    [junit] at java.lang.ClassLoader.loadClass(ClassLoader.java:425)
    [junit] at sun.misc.Launcher$AppClassLoader.loadClass(Launcher.java:308)
    [junit] at java.lang.ClassLoader.loadClass(ClassLoader.java:358)
    [junit] at java.lang.reflect.Constructor.newInstance(Constructor.java:526)
    [junit] Caused by: java.lang.ClassNotFoundException: org.hamcrest.SelfDescribing
    [junit] at java.net.URLClassLoader$1.run(URLClassLoader.java:366)
    [junit] at java.net.URLClassLoader$1.run(URLClassLoader.java:355)
    [junit] at java.security.AccessController.doPrivileged(Native Method)
    [junit] at java.net.URLClassLoader.findClass(URLClassLoader.java:354)
    [junit] at java.lang.ClassLoader.loadClass(ClassLoader.java:425)
    [junit] at sun.misc.Launcher$AppClassLoader.loadClass(Launcher.java:308)
    [junit] at java.lang.ClassLoader.loadClass(ClassLoader.java:358)
    [junit]
    [junit]
    [junit] Test org.apache.pivot.xml.test.XMLSerializerTest FAILED
     [echo] demos: Executing test cases...
     [echo] demos-server: Executing test cases...
     [echo] tests: Executing test cases...
     [echo] tutorials: Executing test cases...
     [echo] tutorials-server: Executing test cases...
     [echo] web: Executing test cases...
    [junit] Testsuite: org.apache.pivot.web.test.QueryDictionaryTest
    [junit] Tests run: 1, Failures: 0, Errors: 1, Skipped: 0, Time elapsed: 0.018 sec
    [junit]
    [junit] Testcase: initializationError(org.apache.pivot.web.test.QueryDictionaryTest): Caused an ERROR
    [junit] org/hamcrest/SelfDescribing
    [junit] java.lang.NoClassDefFoundError: org/hamcrest/SelfDescribing
    [junit] at java.lang.ClassLoader.defineClass1(Native Method)
    [junit] at java.lang.ClassLoader.defineClass(ClassLoader.java:800)
    [junit] at java.security.SecureClassLoader.defineClass(SecureClassLoader.java:142)
    [junit] at java.net.URLClassLoader.defineClass(URLClassLoader.java:449)
    [junit] at java.net.URLClassLoader.access$100(URLClassLoader.java:71)
    [junit] at java.net.URLClassLoader$1.run(URLClassLoader.java:361)
    [junit] at java.net.URLClassLoader$1.run(URLClassLoader.java:355)
    [junit] at java.security.AccessController.doPrivileged(Native Method)
    [junit] at java.net.URLClassLoader.findClass(URLClassLoader.java:354)
    [junit] at java.lang.ClassLoader.loadClass(ClassLoader.java:425)
    [junit] at sun.misc.Launcher$AppClassLoader.loadClass(Launcher.java:308)
    [junit] at java.lang.ClassLoader.loadClass(ClassLoader.java:358)
    [junit] at java.lang.reflect.Constructor.newInstance(Constructor.java:526)
    [junit] Caused by: java.lang.ClassNotFoundException: org.hamcrest.SelfDescribing
    [junit] at java.net.URLClassLoader$1.run(URLClassLoader.java:366)
    [junit] at java.net.URLClassLoader$1.run(URLClassLoader.java:355)
    [junit] at java.security.AccessController.doPrivileged(Native Method)
    [junit] at java.net.URLClassLoader.findClass(URLClassLoader.java:354)
    [junit] at java.lang.ClassLoader.loadClass(ClassLoader.java:425)
    [junit] at sun.misc.Launcher$AppClassLoader.loadClass(Launcher.java:308)
    [junit] at java.lang.ClassLoader.loadClass(ClassLoader.java:358)
    [junit]
    [junit]
    [junit] Test org.apache.pivot.web.test.QueryDictionaryTest FAILED
     [echo] web-server: Executing test cases...
     [echo] wtk: Executing test cases...
     [echo] wtk-terra: Executing test cases...

BUILD FAILED
<https://builds.apache.org/job/Pivot-trunk%20on%20Java%207/ws/pivot_trunk/build.xml>:460: Error: One or more tests failed!

Total time: 24 seconds
Build step 'Invoke Ant' marked build as failure
Reply | Threaded
Open this post in threaded view
|  
Report Content as Inappropriate

Build failed in Jenkins: Pivot-trunk on Java 7 #1226

Apache Jenkins Server
See <https://builds.apache.org/job/Pivot-trunk%20on%20Java%207/1226/display/redirect?page=changes>

Changes:

[rwhitcomb] Tweak some line wrapping and do a static import to reduce line length.

------------------------------------------
[...truncated 53.09 KB...]
    [junit] at java.lang.ClassLoader.defineClass1(Native Method)
    [junit] at java.lang.ClassLoader.defineClass(ClassLoader.java:800)
    [junit] at java.security.SecureClassLoader.defineClass(SecureClassLoader.java:142)
    [junit] at java.net.URLClassLoader.defineClass(URLClassLoader.java:449)
    [junit] at java.net.URLClassLoader.access$100(URLClassLoader.java:71)
    [junit] at java.net.URLClassLoader$1.run(URLClassLoader.java:361)
    [junit] at java.net.URLClassLoader$1.run(URLClassLoader.java:355)
    [junit] at java.security.AccessController.doPrivileged(Native Method)
    [junit] at java.net.URLClassLoader.findClass(URLClassLoader.java:354)
    [junit] at java.lang.ClassLoader.loadClass(ClassLoader.java:425)
    [junit] at sun.misc.Launcher$AppClassLoader.loadClass(Launcher.java:308)
    [junit] at java.lang.ClassLoader.loadClass(ClassLoader.java:358)
    [junit] at java.lang.reflect.Constructor.newInstance(Constructor.java:526)
    [junit] Caused by: java.lang.ClassNotFoundException: org.hamcrest.SelfDescribing
    [junit] at java.net.URLClassLoader$1.run(URLClassLoader.java:366)
    [junit] at java.net.URLClassLoader$1.run(URLClassLoader.java:355)
    [junit] at java.security.AccessController.doPrivileged(Native Method)
    [junit] at java.net.URLClassLoader.findClass(URLClassLoader.java:354)
    [junit] at java.lang.ClassLoader.loadClass(ClassLoader.java:425)
    [junit] at sun.misc.Launcher$AppClassLoader.loadClass(Launcher.java:308)
    [junit] at java.lang.ClassLoader.loadClass(ClassLoader.java:358)
    [junit]
    [junit]
    [junit] Test org.apache.pivot.serialization.test.StringSerializerTest FAILED
    [junit] Testsuite: org.apache.pivot.util.concurrent.test.TaskTest
    [junit] Tests run: 1, Failures: 0, Errors: 1, Skipped: 0, Time elapsed: 0.016 sec
    [junit]
    [junit] Testcase: initializationError(org.apache.pivot.util.concurrent.test.TaskTest): Caused an ERROR
    [junit] org/hamcrest/SelfDescribing
    [junit] java.lang.NoClassDefFoundError: org/hamcrest/SelfDescribing
    [junit] at java.lang.ClassLoader.defineClass1(Native Method)
    [junit] at java.lang.ClassLoader.defineClass(ClassLoader.java:800)
    [junit] at java.security.SecureClassLoader.defineClass(SecureClassLoader.java:142)
    [junit] at java.net.URLClassLoader.defineClass(URLClassLoader.java:449)
    [junit] at java.net.URLClassLoader.access$100(URLClassLoader.java:71)
    [junit] at java.net.URLClassLoader$1.run(URLClassLoader.java:361)
    [junit] at java.net.URLClassLoader$1.run(URLClassLoader.java:355)
    [junit] at java.security.AccessController.doPrivileged(Native Method)
    [junit] at java.net.URLClassLoader.findClass(URLClassLoader.java:354)
    [junit] at java.lang.ClassLoader.loadClass(ClassLoader.java:425)
    [junit] at sun.misc.Launcher$AppClassLoader.loadClass(Launcher.java:308)
    [junit] at java.lang.ClassLoader.loadClass(ClassLoader.java:358)
    [junit] at java.lang.reflect.Constructor.newInstance(Constructor.java:526)
    [junit] Caused by: java.lang.ClassNotFoundException: org.hamcrest.SelfDescribing
    [junit] at java.net.URLClassLoader$1.run(URLClassLoader.java:366)
    [junit] at java.net.URLClassLoader$1.run(URLClassLoader.java:355)
    [junit] at java.security.AccessController.doPrivileged(Native Method)
    [junit] at java.net.URLClassLoader.findClass(URLClassLoader.java:354)
    [junit] at java.lang.ClassLoader.loadClass(ClassLoader.java:425)
    [junit] at sun.misc.Launcher$AppClassLoader.loadClass(Launcher.java:308)
    [junit] at java.lang.ClassLoader.loadClass(ClassLoader.java:358)
    [junit]
    [junit]
    [junit] Test org.apache.pivot.util.concurrent.test.TaskTest FAILED
    [junit] Testsuite: org.apache.pivot.util.test.MIMETypeTest
    [junit] Tests run: 1, Failures: 0, Errors: 1, Skipped: 0, Time elapsed: 0.017 sec
    [junit]
    [junit] Testcase: initializationError(org.apache.pivot.util.test.MIMETypeTest): Caused an ERROR
    [junit] org/hamcrest/SelfDescribing
    [junit] java.lang.NoClassDefFoundError: org/hamcrest/SelfDescribing
    [junit] at java.lang.ClassLoader.defineClass1(Native Method)
    [junit] at java.lang.ClassLoader.defineClass(ClassLoader.java:800)
    [junit] at java.security.SecureClassLoader.defineClass(SecureClassLoader.java:142)
    [junit] at java.net.URLClassLoader.defineClass(URLClassLoader.java:449)
    [junit] at java.net.URLClassLoader.access$100(URLClassLoader.java:71)
    [junit] at java.net.URLClassLoader$1.run(URLClassLoader.java:361)
    [junit] at java.net.URLClassLoader$1.run(URLClassLoader.java:355)
    [junit] at java.security.AccessController.doPrivileged(Native Method)
    [junit] at java.net.URLClassLoader.findClass(URLClassLoader.java:354)
    [junit] at java.lang.ClassLoader.loadClass(ClassLoader.java:425)
    [junit] at sun.misc.Launcher$AppClassLoader.loadClass(Launcher.java:308)
    [junit] at java.lang.ClassLoader.loadClass(ClassLoader.java:358)
    [junit] at java.lang.reflect.Constructor.newInstance(Constructor.java:526)
    [junit] Caused by: java.lang.ClassNotFoundException: org.hamcrest.SelfDescribing
    [junit] at java.net.URLClassLoader$1.run(URLClassLoader.java:366)
    [junit] at java.net.URLClassLoader$1.run(URLClassLoader.java:355)
    [junit] at java.security.AccessController.doPrivileged(Native Method)
    [junit] at java.net.URLClassLoader.findClass(URLClassLoader.java:354)
    [junit] at java.lang.ClassLoader.loadClass(ClassLoader.java:425)
    [junit] at sun.misc.Launcher$AppClassLoader.loadClass(Launcher.java:308)
    [junit] at java.lang.ClassLoader.loadClass(ClassLoader.java:358)
    [junit]
    [junit]
    [junit] Test org.apache.pivot.util.test.MIMETypeTest FAILED
    [junit] Testsuite: org.apache.pivot.util.test.ParentResourcesTest
    [junit] Tests run: 1, Failures: 0, Errors: 1, Skipped: 0, Time elapsed: 0.017 sec
    [junit]
    [junit] Testcase: initializationError(org.apache.pivot.util.test.ParentResourcesTest): Caused an ERROR
    [junit] org/hamcrest/SelfDescribing
    [junit] java.lang.NoClassDefFoundError: org/hamcrest/SelfDescribing
    [junit] at java.lang.ClassLoader.defineClass1(Native Method)
    [junit] at java.lang.ClassLoader.defineClass(ClassLoader.java:800)
    [junit] at java.security.SecureClassLoader.defineClass(SecureClassLoader.java:142)
    [junit] at java.net.URLClassLoader.defineClass(URLClassLoader.java:449)
    [junit] at java.net.URLClassLoader.access$100(URLClassLoader.java:71)
    [junit] at java.net.URLClassLoader$1.run(URLClassLoader.java:361)
    [junit] at java.net.URLClassLoader$1.run(URLClassLoader.java:355)
    [junit] at java.security.AccessController.doPrivileged(Native Method)
    [junit] at java.net.URLClassLoader.findClass(URLClassLoader.java:354)
    [junit] at java.lang.ClassLoader.loadClass(ClassLoader.java:425)
    [junit] at sun.misc.Launcher$AppClassLoader.loadClass(Launcher.java:308)
    [junit] at java.lang.ClassLoader.loadClass(ClassLoader.java:358)
    [junit] at java.lang.reflect.Constructor.newInstance(Constructor.java:526)
    [junit] Caused by: java.lang.ClassNotFoundException: org.hamcrest.SelfDescribing
    [junit] at java.net.URLClassLoader$1.run(URLClassLoader.java:366)
    [junit] at java.net.URLClassLoader$1.run(URLClassLoader.java:355)
    [junit] at java.security.AccessController.doPrivileged(Native Method)
    [junit] at java.net.URLClassLoader.findClass(URLClassLoader.java:354)
    [junit] at java.lang.ClassLoader.loadClass(ClassLoader.java:425)
    [junit] at sun.misc.Launcher$AppClassLoader.loadClass(Launcher.java:308)
    [junit] at java.lang.ClassLoader.loadClass(ClassLoader.java:358)
    [junit]
    [junit]
    [junit] Test org.apache.pivot.util.test.ParentResourcesTest FAILED
    [junit] Testsuite: org.apache.pivot.util.test.TimeTest
    [junit] Tests run: 1, Failures: 0, Errors: 1, Skipped: 0, Time elapsed: 0.017 sec
    [junit]
    [junit] Testcase: initializationError(org.apache.pivot.util.test.TimeTest): Caused an ERROR
    [junit] org/hamcrest/SelfDescribing
    [junit] java.lang.NoClassDefFoundError: org/hamcrest/SelfDescribing
    [junit] at java.lang.ClassLoader.defineClass1(Native Method)
    [junit] at java.lang.ClassLoader.defineClass(ClassLoader.java:800)
    [junit] at java.security.SecureClassLoader.defineClass(SecureClassLoader.java:142)
    [junit] at java.net.URLClassLoader.defineClass(URLClassLoader.java:449)
    [junit] at java.net.URLClassLoader.access$100(URLClassLoader.java:71)
    [junit] at java.net.URLClassLoader$1.run(URLClassLoader.java:361)
    [junit] at java.net.URLClassLoader$1.run(URLClassLoader.java:355)
    [junit] at java.security.AccessController.doPrivileged(Native Method)
    [junit] at java.net.URLClassLoader.findClass(URLClassLoader.java:354)
    [junit] at java.lang.ClassLoader.loadClass(ClassLoader.java:425)
    [junit] at sun.misc.Launcher$AppClassLoader.loadClass(Launcher.java:308)
    [junit] at java.lang.ClassLoader.loadClass(ClassLoader.java:358)
    [junit] at java.lang.reflect.Constructor.newInstance(Constructor.java:526)
    [junit] Caused by: java.lang.ClassNotFoundException: org.hamcrest.SelfDescribing
    [junit] at java.net.URLClassLoader$1.run(URLClassLoader.java:366)
    [junit] at java.net.URLClassLoader$1.run(URLClassLoader.java:355)
    [junit] at java.security.AccessController.doPrivileged(Native Method)
    [junit] at java.net.URLClassLoader.findClass(URLClassLoader.java:354)
    [junit] at java.lang.ClassLoader.loadClass(ClassLoader.java:425)
    [junit] at sun.misc.Launcher$AppClassLoader.loadClass(Launcher.java:308)
    [junit] at java.lang.ClassLoader.loadClass(ClassLoader.java:358)
    [junit]
    [junit]
    [junit] Test org.apache.pivot.util.test.TimeTest FAILED
    [junit] Testsuite: org.apache.pivot.util.test.VersionTest
    [junit] Tests run: 1, Failures: 0, Errors: 1, Skipped: 0, Time elapsed: 0.016 sec
    [junit]
    [junit] Testcase: initializationError(org.apache.pivot.util.test.VersionTest): Caused an ERROR
    [junit] org/hamcrest/SelfDescribing
    [junit] java.lang.NoClassDefFoundError: org/hamcrest/SelfDescribing
    [junit] at java.lang.ClassLoader.defineClass1(Native Method)
    [junit] at java.lang.ClassLoader.defineClass(ClassLoader.java:800)
    [junit] at java.security.SecureClassLoader.defineClass(SecureClassLoader.java:142)
    [junit] at java.net.URLClassLoader.defineClass(URLClassLoader.java:449)
    [junit] at java.net.URLClassLoader.access$100(URLClassLoader.java:71)
    [junit] at java.net.URLClassLoader$1.run(URLClassLoader.java:361)
    [junit] at java.net.URLClassLoader$1.run(URLClassLoader.java:355)
    [junit] at java.security.AccessController.doPrivileged(Native Method)
    [junit] at java.net.URLClassLoader.findClass(URLClassLoader.java:354)
    [junit] at java.lang.ClassLoader.loadClass(ClassLoader.java:425)
    [junit] at sun.misc.Launcher$AppClassLoader.loadClass(Launcher.java:308)
    [junit] at java.lang.ClassLoader.loadClass(ClassLoader.java:358)
    [junit] at java.lang.reflect.Constructor.newInstance(Constructor.java:526)
    [junit] Caused by: java.lang.ClassNotFoundException: org.hamcrest.SelfDescribing
    [junit] at java.net.URLClassLoader$1.run(URLClassLoader.java:366)
    [junit] at java.net.URLClassLoader$1.run(URLClassLoader.java:355)
    [junit] at java.security.AccessController.doPrivileged(Native Method)
    [junit] at java.net.URLClassLoader.findClass(URLClassLoader.java:354)
    [junit] at java.lang.ClassLoader.loadClass(ClassLoader.java:425)
    [junit] at sun.misc.Launcher$AppClassLoader.loadClass(Launcher.java:308)
    [junit] at java.lang.ClassLoader.loadClass(ClassLoader.java:358)
    [junit]
    [junit]
    [junit] Test org.apache.pivot.util.test.VersionTest FAILED
    [junit] Testsuite: org.apache.pivot.xml.test.XMLSerializerTest
    [junit] Tests run: 1, Failures: 0, Errors: 1, Skipped: 0, Time elapsed: 0.016 sec
    [junit]
    [junit] Testcase: initializationError(org.apache.pivot.xml.test.XMLSerializerTest): Caused an ERROR
    [junit] org/hamcrest/SelfDescribing
    [junit] java.lang.NoClassDefFoundError: org/hamcrest/SelfDescribing
    [junit] at java.lang.ClassLoader.defineClass1(Native Method)
    [junit] at java.lang.ClassLoader.defineClass(ClassLoader.java:800)
    [junit] at java.security.SecureClassLoader.defineClass(SecureClassLoader.java:142)
    [junit] at java.net.URLClassLoader.defineClass(URLClassLoader.java:449)
    [junit] at java.net.URLClassLoader.access$100(URLClassLoader.java:71)
    [junit] at java.net.URLClassLoader$1.run(URLClassLoader.java:361)
    [junit] at java.net.URLClassLoader$1.run(URLClassLoader.java:355)
    [junit] at java.security.AccessController.doPrivileged(Native Method)
    [junit] at java.net.URLClassLoader.findClass(URLClassLoader.java:354)
    [junit] at java.lang.ClassLoader.loadClass(ClassLoader.java:425)
    [junit] at sun.misc.Launcher$AppClassLoader.loadClass(Launcher.java:308)
    [junit] at java.lang.ClassLoader.loadClass(ClassLoader.java:358)
    [junit] at java.lang.reflect.Constructor.newInstance(Constructor.java:526)
    [junit] Caused by: java.lang.ClassNotFoundException: org.hamcrest.SelfDescribing
    [junit] at java.net.URLClassLoader$1.run(URLClassLoader.java:366)
    [junit] at java.net.URLClassLoader$1.run(URLClassLoader.java:355)
    [junit] at java.security.AccessController.doPrivileged(Native Method)
    [junit] at java.net.URLClassLoader.findClass(URLClassLoader.java:354)
    [junit] at java.lang.ClassLoader.loadClass(ClassLoader.java:425)
    [junit] at sun.misc.Launcher$AppClassLoader.loadClass(Launcher.java:308)
    [junit] at java.lang.ClassLoader.loadClass(ClassLoader.java:358)
    [junit]
    [junit]
    [junit] Test org.apache.pivot.xml.test.XMLSerializerTest FAILED
     [echo] demos: Executing test cases...
     [echo] demos-server: Executing test cases...
     [echo] tests: Executing test cases...
     [echo] tutorials: Executing test cases...
     [echo] tutorials-server: Executing test cases...
     [echo] web: Executing test cases...
    [junit] Testsuite: org.apache.pivot.web.test.QueryDictionaryTest
    [junit] Tests run: 1, Failures: 0, Errors: 1, Skipped: 0, Time elapsed: 0.204 sec
    [junit]
    [junit] Testcase: initializationError(org.apache.pivot.web.test.QueryDictionaryTest): Caused an ERROR
    [junit] org/hamcrest/SelfDescribing
    [junit] java.lang.NoClassDefFoundError: org/hamcrest/SelfDescribing
    [junit] at java.lang.ClassLoader.defineClass1(Native Method)
    [junit] at java.lang.ClassLoader.defineClass(ClassLoader.java:800)
    [junit] at java.security.SecureClassLoader.defineClass(SecureClassLoader.java:142)
    [junit] at java.net.URLClassLoader.defineClass(URLClassLoader.java:449)
    [junit] at java.net.URLClassLoader.access$100(URLClassLoader.java:71)
    [junit] at java.net.URLClassLoader$1.run(URLClassLoader.java:361)
    [junit] at java.net.URLClassLoader$1.run(URLClassLoader.java:355)
    [junit] at java.security.AccessController.doPrivileged(Native Method)
    [junit] at java.net.URLClassLoader.findClass(URLClassLoader.java:354)
    [junit] at java.lang.ClassLoader.loadClass(ClassLoader.java:425)
    [junit] at sun.misc.Launcher$AppClassLoader.loadClass(Launcher.java:308)
    [junit] at java.lang.ClassLoader.loadClass(ClassLoader.java:358)
    [junit] at java.lang.reflect.Constructor.newInstance(Constructor.java:526)
    [junit] Caused by: java.lang.ClassNotFoundException: org.hamcrest.SelfDescribing
    [junit] at java.net.URLClassLoader$1.run(URLClassLoader.java:366)
    [junit] at java.net.URLClassLoader$1.run(URLClassLoader.java:355)
    [junit] at java.security.AccessController.doPrivileged(Native Method)
    [junit] at java.net.URLClassLoader.findClass(URLClassLoader.java:354)
    [junit] at java.lang.ClassLoader.loadClass(ClassLoader.java:425)
    [junit] at sun.misc.Launcher$AppClassLoader.loadClass(Launcher.java:308)
    [junit] at java.lang.ClassLoader.loadClass(ClassLoader.java:358)
    [junit]
    [junit]
    [junit] Test org.apache.pivot.web.test.QueryDictionaryTest FAILED
     [echo] web-server: Executing test cases...
     [echo] wtk: Executing test cases...
     [echo] wtk-terra: Executing test cases...

BUILD FAILED
<https://builds.apache.org/job/Pivot-trunk%20on%20Java%207/ws/pivot_trunk/build.xml>:460: Error: One or more tests failed!

Total time: 28 seconds
Build step 'Invoke Ant' marked build as failure
Reply | Threaded
Open this post in threaded view
|  
Report Content as Inappropriate

Jenkins build is back to normal : Pivot-trunk on Java 7 #1227

Apache Jenkins Server
Loading...